Jump to content

Serial.com

Members
  • Content Count

    100
  • Joined

  • Last visited

Posts posted by Serial.com


  1. Olá Equipe Kaspersky

    Após apanhar um pouco para instalar o Kesl no Desktop com Deepin 15.8 obtive êxito, mas agora vem algumas duvidas:

    O monitoramento de integridade faz parte de outro pacote ou o botão não habilita nesta versão do Kesl, vide imagem abaixo.

    1912918884_CapturadeTela_20181203093353.png.e8eb4f428931a6e45b6b307a0dac11c3.png

     

    Conforme imagem abaixo, desabilitei o firewall padrão do linux Deepin Gufw: e acredito que por estar ativado o do Kesl não preciso no momento mais desse. Correto?

     

    1316466433_CapturadeTela_20181203095030.png.94130c376d2de57e976727ae2280d573.png

    Foi encontrado 4 vírus em dados que estavam em Pen Driver que havia colocado em um dos HDs e após deletado está ok

    Objetos ignorados                          1432
    objetos protegidos por senha           15

    Houve diversos erros de scan em arquivos txt vide imagem abaixo: Creio que isso deva ser "padrão". Também não sei como faço para buscar relatório TXT do Scam completo e se é possível.

    2146089940_CapturadeTela_20181203095725.png.d90a4bc41cd684576e63949ef6a7658e.png

     

    Foram II HDs de I tera cada, escaneados todos com sistemas Linux e arquivos diversos com duração de 06:00Hs. 

    A maquina é modesta "antiga" conforme imagem abaixo, mas a leveza do ksel é muito boa.

    242571669_CapturadeTela_20181203100325.png.ee2c0e0873521831cf56a7b820f222ee.png

     

    Tenho a impressão de estar usando um motor de Ferrari num fusquinha 69, mas enquanto a kasperky não Bola nada para Destopk Linux domestico "Free ou versão Paga", creio que esta seja uma das melhores opções ao usuário comum. Se houver outra opção para linux da Kaspersky, me avisem por favor.

    Este Kesl consegui detectar e bloquear vírus no Cliente de E-mali Thunderbird automaticamente ou é preciso configurá-lo?

    Estas são as minhas impressões inicialmente e caso possam me ajudar com estas duvidas fico muito grato

    Serial.com


  2. Hello Equipe kaspersky

     apologize for the inconvenience and complaint (!)

    I ended up finding out why not being able to install Kesl.

    It was because of the previous AV Eset for Linux 4.0.90 that was still installed on the machine, or part of it and Kesl could not verify the integrity of the Eset file at the time of installation, being: libesets_pac.so

    Follow the data:

    [0;1;31m●[0m kesl-supervisor.service - kesl
       Loaded: loaded (/etc/systemd/system/kesl-supervisor.service; enabled; vendor preset: enabled)
       Active: [0;1;31mfailed[0m (Result: exit-code) since Sun 2018-12-02 22:52:59 -02; 21s ago
      Process: 7797 ExecStart=/etc/init.d/kesl-supervisor start [0;1;31m(code=exited, status=255)[0m

    dez 02 22:52:50 edson-PC kesl[8003]: [0;1;31m[0;1;39m[0;1;31m{"EventType": "IntegrityCheckFailed","EventId": "0","FileName": "/usr/lib/x86_64-linux-gnu/libesets_pac.so"}[0m
    dez 02 22:52:51 edson-PC kesl[8024]: [0;1;31m[0;1;39m[0;1;31m{"EventType": "IntegrityCheckFailed","EventId": "0","FileName": "/usr/lib/x86_64-linux-gnu/libesets_pac.so"}[0m
    dez 02 22:52:53 edson-PC kesl[8036]: [0;1;31m[0;1;39m[0;1;31m{"EventType": "IntegrityCheckFailed","EventId": "0","FileName": "/usr/lib/x86_64-linux-gnu/libesets_pac.so"}[0m
    dez 02 22:52:54 edson-PC kesl[8051]: [0;1;31m[0;1;39m[0;1;31m{"EventType": "IntegrityCheckFailed","EventId": "0","FileName": "/usr/lib/x86_64-linux-gnu/libesets_pac.so"}[0m
    dez 02 22:52:56 edson-PC kesl[8073]: [0;1;31m[0;1;39m[0;1;31m{"EventType": "IntegrityCheckFailed","EventId": "0","FileName": "/usr/lib/x86_64-linux-gnu/libesets_pac.so"}[0m
    dez 02 22:52:59 edson-PC kesl-supervisor[7797]: /etc/init.d/kesl-supervisor: 505: kill: No such process
    dez 02 22:52:59 edson-PC kesl-supervisor[7797]: kesl could not be started
    dez 02 22:52:59 edson-PC systemd[1]: [0;1;39m[0;1;31m[0;1;39mkesl-supervisor.service: Control process exited, code=exited status=255[0m
    dez 02 22:52:59 edson-PC systemd[1]: [0;1;39m[0;1;31m[0;1;39mkesl-supervisor.service: Failed with result 'exit-code'.[0m
    dez 02 22:52:59 edson-PC systemd[1]: [0;1;31m[0;1;39m[0;1;31mFailed to start kesl.[0m

    ***********************************

    After complete removal of Eset the installation of Kesl was perfect as follows:

    I thank those who spoke and somehow tried to help me.

    Captura de Tela_20181203010836.png


  3. 20 hours ago, Ivan.Ponomarev said:

    Hello!

    Have you already checked the mentioned? 

    Thanks!

    Hello Ivan

    On a fresh installation attempt the error message is the same:

    Error: Job for kesl-supervisor.service failed because the control process
    exited with error code.
    See "systemctl status kesl-supervisor.service" and "journalctl -xe" for
    details.
    kesl not started


    **************************

    Follow the log generated by systemctl status kesl-supervisor.service

    root@edson-PC:/home/edson# systemctl status kesl-supervisor.service
    ● kesl-supervisor.service - kesl
       Loaded: loaded (/etc/systemd/system/kesl-supervisor.service; enabled; vendor preset: 
       Active: failed (Result: exit-code) since Sun 2018-12-02 20:26:14 -02; 1min 13s ago
      Process: 8723 ExecStart=/etc/init.d/kesl-supervisor start (code=exited, status=255)

    dez 02 20:26:05 edson-PC kesl[8872]: {"EventType": "IntegrityCheckFailed","EventId": "0"
    dez 02 20:26:06 edson-PC kesl[8892]: {"EventType": "IntegrityCheckFailed","EventId": "0"
    dez 02 20:26:07 edson-PC kesl[8904]: {"EventType": "IntegrityCheckFailed","EventId": "0"
    dez 02 20:26:09 edson-PC kesl[8919]: {"EventType": "IntegrityCheckFailed","EventId": "0"
    dez 02 20:26:10 edson-PC kesl[8946]: {"EventType": "IntegrityCheckFailed","EventId": "0"
    dez 02 20:26:14 edson-PC kesl-supervisor[8723]: /etc/init.d/kesl-supervisor: 505: kill: 
    dez 02 20:26:14 edson-PC kesl-supervisor[8723]: kesl could not be started
    dez 02 20:26:14 edson-PC systemd[1]: kesl-supervisor.service: Control process exited, co
    dez 02 20:26:14 edson-PC systemd[1]: kesl-supervisor.service: Failed with result 'exit-c
    dez 02 20:26:14 edson-PC systemd[1]: Failed to start kesl.
    lines 1-15/15 (END)

    ● kesl-supervisor.service - kesl
       Loaded: loaded (/etc/systemd/system/kesl-supervisor.service; enabled; vendor preset: e
       Active: failed (Result: exit-code) since Sun 2018-12-02 20:26:14 -02; 1min 13s ago
      Process: 8723 ExecStart=/etc/init.d/kesl-supervisor start (code=exited, status=255)

    dez 02 20:26:05 edson-PC kesl[8872]: {"EventType": "IntegrityCheckFailed","EventId": "0",
    dez 02 20:26:06 edson-PC kesl[8892]: {"EventType": "IntegrityCheckFailed","EventId": "0",
    dez 02 20:26:07 edson-PC kesl[8904]: {"EventType": "IntegrityCheckFailed","EventId": "0",
    dez 02 20:26:09 edson-PC kesl[8919]: {"EventType": "IntegrityCheckFailed","EventId": "0",
    dez 02 20:26:10 edson-PC kesl[8946]: {"EventType": "IntegrityCheckFailed","EventId": "0",
    dez 02 20:26:14 edson-PC kesl-supervisor[8723]: /etc/init.d/kesl-supervisor: 505: kill: N
    dez 02 20:26:14 edson-PC kesl-supervisor[8723]: kesl could not be started
    dez 02 20:26:14 edson-PC systemd[1]: kesl-supervisor.service: Control process exited, cod
    dez 02 20:26:14 edson-PC systemd[1]: kesl-supervisor.service: Failed with result 'exit-co
    dez 02 20:26:14 edson-PC systemd[1]: Failed to start kesl.

    *************************
    lines 1-15/15 (END)

    ● kesl-supervisor.service - kesl
       Loaded: loaded (/etc/systemd/system/kesl-supervisor.service; enabled; vendor preset: en
       Active: failed (Result: exit-code) since Sun 2018-12-02 20:26:14 -02; 1min 13s ago
      Process: 8723 ExecStart=/etc/init.d/kesl-supervisor start (code=exited, status=255)

    dez 02 20:26:05 edson-PC kesl[8872]: {"EventType": "IntegrityCheckFailed","EventId": "0","
    dez 02 20:26:06 edson-PC kesl[8892]: {"EventType": "IntegrityCheckFailed","EventId": "0","
    dez 02 20:26:07 edson-PC kesl[8904]: {"EventType": "IntegrityCheckFailed","EventId": "0","
    dez 02 20:26:09 edson-PC kesl[8919]: {"EventType": "IntegrityCheckFailed","EventId": "0","
    dez 02 20:26:10 edson-PC kesl[8946]: {"EventType": "IntegrityCheckFailed","EventId": "0","
    dez 02 20:26:14 edson-PC kesl-supervisor[8723]: /etc/init.d/kesl-supervisor: 505: kill: No
    dez 02 20:26:14 edson-PC kesl-supervisor[8723]: kesl could not be started
    dez 02 20:26:14 edson-PC systemd[1]: kesl-supervisor.service: Control process exited, code
    dez 02 20:26:14 edson-PC systemd[1]: kesl-supervisor.service: Failed with result 'exit-cod
    dez 02 20:26:14 edson-PC systemd[1]: Failed to start kesl.

    ***************************************************
    lines 1-15/15 (END)

    ● kesl-supervisor.service - kesl
       Loaded: loaded (/etc/systemd/system/kesl-supervisor.service; enabled; vendor preset: ena
       Active: failed (Result: exit-code) since Sun 2018-12-02 20:26:14 -02; 1min 13s ago
      Process: 8723 ExecStart=/etc/init.d/kesl-supervisor start (code=exited, status=255)

    dez 02 20:26:05 edson-PC kesl[8872]: {"EventType": "IntegrityCheckFailed","EventId": "0","F
    dez 02 20:26:06 edson-PC kesl[8892]: {"EventType": "IntegrityCheckFailed","EventId": "0","F
    dez 02 20:26:07 edson-PC kesl[8904]: {"EventType": "IntegrityCheckFailed","EventId": "0","F
    dez 02 20:26:09 edson-PC kesl[8919]: {"EventType": "IntegrityCheckFailed","EventId": "0","F
    dez 02 20:26:10 edson-PC kesl[8946]: {"EventType": "IntegrityCheckFailed","EventId": "0","F
    dez 02 20:26:14 edson-PC kesl-supervisor[8723]: /etc/init.d/kesl-supervisor: 505: kill: No 
    dez 02 20:26:14 edson-PC kesl-supervisor[8723]: kesl could not be started
    dez 02 20:26:14 edson-PC systemd[1]: kesl-supervisor.service: Control process exited, code=
    dez 02 20:26:14 edson-PC systemd[1]: kesl-supervisor.service: Failed with result 'exit-code
    dez 02 20:26:14 edson-PC systemd[1]: Failed to start kesl.

    *****************************************
    lines 1-15/15 (END)

    ● kesl-supervisor.service - kesl
       Loaded: loaded (/etc/systemd/system/kesl-supervisor.service; enabled; vendor preset: enab
       Active: failed (Result: exit-code) since Sun 2018-12-02 20:26:14 -02; 1min 13s ago
      Process: 8723 ExecStart=/etc/init.d/kesl-supervisor start (code=exited, status=255)

    dez 02 20:26:05 edson-PC kesl[8872]: {"EventType": "IntegrityCheckFailed","EventId": "0","Fi
    dez 02 20:26:06 edson-PC kesl[8892]: {"EventType": "IntegrityCheckFailed","EventId": "0","Fi
    dez 02 20:26:07 edson-PC kesl[8904]: {"EventType": "IntegrityCheckFailed","EventId": "0","Fi
    dez 02 20:26:09 edson-PC kesl[8919]: {"EventType": "IntegrityCheckFailed","EventId": "0","Fi
    dez 02 20:26:10 edson-PC kesl[8946]: {"EventType": "IntegrityCheckFailed","EventId": "0","Fi
    dez 02 20:26:14 edson-PC kesl-supervisor[8723]: /etc/init.d/kesl-supervisor: 505: kill: No s
    dez 02 20:26:14 edson-PC kesl-supervisor[8723]: kesl could not be started
    dez 02 20:26:14 edson-PC systemd[1]: kesl-supervisor.service: Control process exited, code=e
    dez 02 20:26:14 edson-PC systemd[1]: kesl-supervisor.service: Failed with result 'exit-code'
    dez 02 20:26:14 edson-PC systemd[1]: Failed to start kesl.

    **************************
    lines 1-15/15 (END)

    ● kesl-supervisor.service - kesl
       Loaded: loaded (/etc/systemd/system/kesl-supervisor.service; enabled; vendor preset: enabl
       Active: failed (Result: exit-code) since Sun 2018-12-02 20:26:14 -02; 1min 13s ago
      Process: 8723 ExecStart=/etc/init.d/kesl-supervisor start (code=exited, status=255)

    dez 02 20:26:05 edson-PC kesl[8872]: {"EventType": "IntegrityCheckFailed","EventId": "0","Fil
    dez 02 20:26:06 edson-PC kesl[8892]: {"EventType": "IntegrityCheckFailed","EventId": "0","Fil
    dez 02 20:26:07 edson-PC kesl[8904]: {"EventType": "IntegrityCheckFailed","EventId": "0","Fil
    dez 02 20:26:09 edson-PC kesl[8919]: {"EventType": "IntegrityCheckFailed","EventId": "0","Fil
    dez 02 20:26:10 edson-PC kesl[8946]: {"EventType": "IntegrityCheckFailed","EventId": "0","Fil
    dez 02 20:26:14 edson-PC kesl-supervisor[8723]: /etc/init.d/kesl-supervisor: 505: kill: No su
    dez 02 20:26:14 edson-PC kesl-supervisor[8723]: kesl could not be started
    dez 02 20:26:14 edson-PC systemd[1]: kesl-supervisor.service: Control process exited, code=ex
    dez 02 20:26:14 edson-PC systemd[1]: kesl-supervisor.service: Failed with result 'exit-code'.
    dez 02 20:26:14 edson-PC systemd[1]: Failed to start kesl.

    *****************************************
    lines 1-15/15 (END)

    ● kesl-supervisor.service - kesl
       Loaded: loaded (/etc/systemd/system/kesl-supervisor.service; enabled; vendor preset: enable
       Active: failed (Result: exit-code) since Sun 2018-12-02 20:26:14 -02; 1min 13s ago
      Process: 8723 ExecStart=/etc/init.d/kesl-supervisor start (code=exited, status=255)

    dez 02 20:26:05 edson-PC kesl[8872]: {"EventType": "IntegrityCheckFailed","EventId": "0","File
    dez 02 20:26:06 edson-PC kesl[8892]: {"EventType": "IntegrityCheckFailed","EventId": "0","File
    dez 02 20:26:07 edson-PC kesl[8904]: {"EventType": "IntegrityCheckFailed","EventId": "0","File
    dez 02 20:26:09 edson-PC kesl[8919]: {"EventType": "IntegrityCheckFailed","EventId": "0","File
    dez 02 20:26:10 edson-PC kesl[8946]: {"EventType": "IntegrityCheckFailed","EventId": "0","File
    dez 02 20:26:14 edson-PC kesl-supervisor[8723]: /etc/init.d/kesl-supervisor: 505: kill: No suc
    dez 02 20:26:14 edson-PC kesl-supervisor[8723]: kesl could not be started
    dez 02 20:26:14 edson-PC systemd[1]: kesl-supervisor.service: Control process exited, code=exi
    dez 02 20:26:14 edson-PC systemd[1]: kesl-supervisor.service: Failed with result 'exit-code'.
    dez 02 20:26:14 edson-PC systemd[1]: Failed to start kesl.

    *****************************
    lines 1-15/15 (END)

    ● kesl-supervisor.service - kesl
       Loaded: loaded (/etc/systemd/system/kesl-supervisor.service; enabled; vendor preset: enabled
       Active: failed (Result: exit-code) since Sun 2018-12-02 20:26:14 -02; 1min 13s ago
      Process: 8723 ExecStart=/etc/init.d/kesl-supervisor start (code=exited, status=255)

    dez 02 20:26:05 edson-PC kesl[8872]: {"EventType": "IntegrityCheckFailed","EventId": "0","FileN
    dez 02 20:26:06 edson-PC kesl[8892]: {"EventType": "IntegrityCheckFailed","EventId": "0","FileN
    dez 02 20:26:07 edson-PC kesl[8904]: {"EventType": "IntegrityCheckFailed","EventId": "0","FileN
    dez 02 20:26:09 edson-PC kesl[8919]: {"EventType": "IntegrityCheckFailed","EventId": "0","FileN
    dez 02 20:26:10 edson-PC kesl[8946]: {"EventType": "IntegrityCheckFailed","EventId": "0","FileN
    dez 02 20:26:14 edson-PC kesl-supervisor[8723]: /etc/init.d/kesl-supervisor: 505: kill: No such
    dez 02 20:26:14 edson-PC kesl-supervisor[8723]: kesl could not be started
    dez 02 20:26:14 edson-PC systemd[1]: kesl-supervisor.service: Control process exited, code=exit
    dez 02 20:26:14 edson-PC systemd[1]: kesl-supervisor.service: Failed with result 'exit-code'.
    dez 02 20:26:14 edson-PC systemd[1]: Failed to start kesl.

    *************************
    lines 1-15/15 (END)

    ● kesl-supervisor.service - kesl
       Loaded: loaded (/etc/systemd/system/kesl-supervisor.service; enabled; vendor preset: enabled)
       Active: failed (Result: exit-code) since Sun 2018-12-02 20:26:14 -02; 1min 13s ago
      Process: 8723 ExecStart=/etc/init.d/kesl-supervisor start (code=exited, status=255)

    dez 02 20:26:05 edson-PC kesl[8872]: {"EventType": "IntegrityCheckFailed","EventId": "0","FileNa
    dez 02 20:26:06 edson-PC kesl[8892]: {"EventType": "IntegrityCheckFailed","EventId": "0","FileNa
    dez 02 20:26:07 edson-PC kesl[8904]: {"EventType": "IntegrityCheckFailed","EventId": "0","FileNa
    dez 02 20:26:09 edson-PC kesl[8919]: {"EventType": "IntegrityCheckFailed","EventId": "0","FileNa
    dez 02 20:26:10 edson-PC kesl[8946]: {"EventType": "IntegrityCheckFailed","EventId": "0","FileNa
    dez 02 20:26:14 edson-PC kesl-supervisor[8723]: /etc/init.d/kesl-supervisor: 505: kill: No such 
    dez 02 20:26:14 edson-PC kesl-supervisor[8723]: kesl could not be started
    dez 02 20:26:14 edson-PC systemd[1]: kesl-supervisor.service: Control process exited, code=exite
    dez 02 20:26:14 edson-PC systemd[1]: kesl-supervisor.service: Failed with result 'exit-code'.
    dez 02 20:26:14 edson-PC systemd[1]: Failed to start kesl.

    ******************************
    lines 1-15/15 (END)

    ● kesl-supervisor.service - kesl
       Loaded: loaded (/etc/systemd/system/kesl-supervisor.service; enabled; vendor preset: enabled)
       Active: failed (Result: exit-code) since Sun 2018-12-02 20:26:14 -02; 1min 13s ago
      Process: 8723 ExecStart=/etc/init.d/kesl-supervisor start (code=exited, status=255)

    dez 02 20:26:05 edson-PC kesl[8872]: {"EventType": "IntegrityCheckFailed","EventId": "0","FileNam
    dez 02 20:26:06 edson-PC kesl[8892]: {"EventType": "IntegrityCheckFailed","EventId": "0","FileNam
    dez 02 20:26:07 edson-PC kesl[8904]: {"EventType": "IntegrityCheckFailed","EventId": "0","FileNam
    dez 02 20:26:09 edson-PC kesl[8919]: {"EventType": "IntegrityCheckFailed","EventId": "0","FileNam
    dez 02 20:26:10 edson-PC kesl[8946]: {"EventType": "IntegrityCheckFailed","EventId": "0","FileNam
    dez 02 20:26:14 edson-PC kesl-supervisor[8723]: /etc/init.d/kesl-supervisor: 505: kill: No such p
    dez 02 20:26:14 edson-PC kesl-supervisor[8723]: kesl could not be started
    dez 02 20:26:14 edson-PC systemd[1]: kesl-supervisor.service: Control process exited, code=exited
    dez 02 20:26:14 edson-PC systemd[1]: kesl-supervisor.service: Failed with result 'exit-code'.
    dez 02 20:26:14 edson-PC systemd[1]: Failed to start kesl.

    *******************************
    lines 1-15/15 (END)...skipping...
    ● kesl-supervisor.service - kesl
       Loaded: loaded (/etc/systemd/system/kesl-supervisor.service; enabled; vendor preset: enabled)
       Active: failed (Result: exit-code) since Sun 2018-12-02 20:26:14 -02; 1min 13s ago
      Process: 8723 ExecStart=/etc/init.d/kesl-supervisor start (code=exited, status=255)

    dez 02 20:26:05 edson-PC kesl[8872]: {"EventType": "IntegrityCheckFailed","EventId": "0","FileName": "/usr/lib/x86_64-linux-
    dez 02 20:26:06 edson-PC kesl[8892]: {"EventType": "IntegrityCheckFailed","EventId": "0","FileName": "/usr/lib/x86_64-linux-
    dez 02 20:26:07 edson-PC kesl[8904]: {"EventType": "IntegrityCheckFailed","EventId": "0","FileName": "/usr/lib/x86_64-linux-
    dez 02 20:26:09 edson-PC kesl[8919]: {"EventType": "IntegrityCheckFailed","EventId": "0","FileName": "/usr/lib/x86_64-linux-
    dez 02 20:26:10 edson-PC kesl[8946]: {"EventType": "IntegrityCheckFailed","EventId": "0","FileName": "/usr/lib/x86_64-linux-
    dez 02 20:26:14 edson-PC kesl-supervisor[8723]: /etc/init.d/kesl-supervisor: 505: kill: No such process
    dez 02 20:26:14 edson-PC kesl-supervisor[8723]: kesl could not be started
    dez 02 20:26:14 edson-PC systemd[1]: kesl-supervisor.service: Control process exited, code=exited status=255
    dez 02 20:26:14 edson-PC systemd[1]: kesl-supervisor.service: Failed with result 'exit-code'.
    dez 02 20:26:14 edson-PC systemd[1]: Failed to start kesl.

    **************************
    lines 1-15/15 (END)


    ● kesl-supervisor.service - kesl
       Loaded: loaded (/etc/systemd/system/kesl-supervisor.service; enabled; vendor preset: enabled)
       Active: failed (Result: exit-code) since Sun 2018-12-02 20:26:14 -02; 1min 13s ago
      Process: 8723 ExecStart=/etc/init.d/kesl-supervisor start (code=exited, status=255)

    dez 02 20:26:05 edson-PC kesl[8872]: {"EventType": "IntegrityCheckFailed","EventId": "0","FileName": "/usr/lib/x8
    dez 02 20:26:06 edson-PC kesl[8892]: {"EventType": "IntegrityCheckFailed","EventId": "0","FileName": "/usr/lib/x8
    dez 02 20:26:07 edson-PC kesl[8904]: {"EventType": "IntegrityCheckFailed","EventId": "0","FileName": "/usr/lib/x8
    dez 02 20:26:09 edson-PC kesl[8919]: {"EventType": "IntegrityCheckFailed","EventId": "0","FileName": "/usr/lib/x8
    dez 02 20:26:10 edson-PC kesl[8946]: {"EventType": "IntegrityCheckFailed","EventId": "0","FileName": "/usr/lib/x8
    dez 02 20:26:14 edson-PC kesl-supervisor[8723]: /etc/init.d/kesl-supervisor: 505: kill: No such process
    dez 02 20:26:14 edson-PC kesl-supervisor[8723]: kesl could not be started
    dez 02 20:26:14 edson-PC systemd[1]: kesl-supervisor.service: Control process exited, code=exited status=255
    dez 02 20:26:14 edson-PC systemd[1]: kesl-supervisor.service: Failed with result 'exit-code'.
    dez 02 20:26:14 edson-PC systemd[1]: Failed to start kesl.
    ****************************************

    root@edson-PC:/home/edson# journalctl -xe
    dez 02 20:40:53 edson-PC audit[10901]: AVC apparmor="DENIED" operation="create" profile="/usr/lib
    dez 02 20:40:53 edson-PC audit[10901]: AVC apparmor="DENIED" operation="create" profile="/usr/lib
    dez 02 20:40:53 edson-PC audit[10901]: AVC apparmor="DENIED" operation="create" profile="/usr/lib
    dez 02 20:40:53 edson-PC audit[10901]: AVC apparmor="DENIED" operation="create" profile="/usr/lib
    dez 02 20:40:53 edson-PC audit[10901]: AVC apparmor="DENIED" operation="create" profile="/usr/lib
    dez 02 20:40:53 edson-PC audit[10901]: AVC apparmor="DENIED" operation="create" profile="/usr/lib
    dez 02 20:40:53 edson-PC audit[10901]: AVC apparmor="DENIED" operation="create" profile="/usr/lib
    dez 02 20:40:53 edson-PC audit[10901]: AVC apparmor="DENIED" operation="create" profile="/usr/lib
    dez 02 20:40:53 edson-PC audit[10901]: AVC apparmor="DENIED" operation="create" profile="/usr/lib
    dez 02 20:40:53 edson-PC kernel: audit: type=1400 audit(1543790453.706:6330): apparmor="DENIED" o
    dez 02 20:40:53 edson-PC kernel: audit: type=1400 audit(1543790453.706:6331): apparmor="DENIED" o
    dez 02 20:40:53 edson-PC kernel: audit: type=1400 audit(1543790453.706:6332): apparmor="DENIED" o
    dez 02 20:40:53 edson-PC kernel: audit: type=1400 audit(1543790453.706:6333): apparmor="DENIED" o
    dez 02 20:40:53 edson-PC kernel: audit: type=1400 audit(1543790453.706:6334): apparmor="DENIED" o
    dez 02 20:40:53 edson-PC kernel: audit: type=1400 audit(1543790453.706:6335): apparmor="DENIED" o
    dez 02 20:40:53 edson-PC kernel: audit: type=1400 audit(1543790453.706:6336): apparmor="DENIED" o
    dez 02 20:40:53 edson-PC starter[4475]: charon has died -- restart scheduled (5sec)
    dez 02 20:40:53 edson-PC ipsec[4475]: charon has died -- restart scheduled (5sec)
    dez 02 20:40:53 edson-PC ipsec[4475]: charon refused to be started
    dez 02 20:40:53 edson-PC starter[4475]: charon refused to be started
    dez 02 20:40:53 edson-PC com.deepin.menu[5134]: 2018-12-02, 20:40:53.760 [Warning] [             
    dez 02 20:40:53 edson-PC com.deepin.menu[5134]: 2018-12-02, 20:40:53.761 [Warning] [             
    lines 1052-1073/1073 (END)
    dez 02 20:40:53 edson-PC audit[10901]: AVC apparmor="DENIED" operation="create" profile="/usr/lib/ipsec/charon" pid=10901 co
    dez 02 20:40:53 edson-PC audit[10901]: AVC apparmor="DENIED" operation="create" profile="/usr/lib/ipsec/charon" pid=10901 co
    dez 02 20:40:53 edson-PC audit[10901]: AVC apparmor="DENIED" operation="create" profile="/usr/lib/ipsec/charon" pid=10901 co
    dez 02 20:40:53 edson-PC audit[10901]: AVC apparmor="DENIED" operation="create" profile="/usr/lib/ipsec/charon" pid=10901 co
    dez 02 20:40:53 edson-PC audit[10901]: AVC apparmor="DENIED" operation="create" profile="/usr/lib/ipsec/charon" pid=10901 co
    dez 02 20:40:53 edson-PC audit[10901]: AVC apparmor="DENIED" operation="create" profile="/usr/lib/ipsec/charon" pid=10901 co
    dez 02 20:40:53 edson-PC audit[10901]: AVC apparmor="DENIED" operation="create" profile="/usr/lib/ipsec/charon" pid=10901 co
    dez 02 20:40:53 edson-PC audit[10901]: AVC apparmor="DENIED" operation="create" profile="/usr/lib/ipsec/charon" pid=10901 co
    dez 02 20:40:53 edson-PC audit[10901]: AVC apparmor="DENIED" operation="create" profile="/usr/lib/ipsec/charon" pid=10901 co
    dez 02 20:40:53 edson-PC kernel: audit: type=1400 audit(1543790453.706:6330): apparmor="DENIED" operation="create" profile="
    dez 02 20:40:53 edson-PC kernel: audit: type=1400 audit(1543790453.706:6331): apparmor="DENIED" operation="create" profile="
    dez 02 20:40:53 edson-PC kernel: audit: type=1400 audit(1543790453.706:6332): apparmor="DENIED" operation="create" profile="
    dez 02 20:40:53 edson-PC kernel: audit: type=1400 audit(1543790453.706:6333): apparmor="DENIED" operation="create" profile="
    dez 02 20:40:53 edson-PC kernel: audit: type=1400 audit(1543790453.706:6334): apparmor="DENIED" operation="create" profile="
    dez 02 20:40:53 edson-PC kernel: audit: type=1400 audit(1543790453.706:6335): apparmor="DENIED" operation="create" profile="
    dez 02 20:40:53 edson-PC kernel: audit: type=1400 audit(1543790453.706:6336): apparmor="DENIED" operation="create" profile="
    dez 02 20:40:53 edson-PC starter[4475]: charon has died -- restart scheduled (5sec)
    dez 02 20:40:53 edson-PC ipsec[4475]: charon has died -- restart scheduled (5sec)
    dez 02 20:40:53 edson-PC ipsec[4475]: charon refused to be started
    dez 02 20:40:53 edson-PC starter[4475]: charon refused to be started
    dez 02 20:40:53 edson-PC com.deepin.menu[5134]: 2018-12-02, 20:40:53.760 [Warning] [                                        
    dez 02 20:40:53 edson-PC com.deepin.menu[5134]: 2018-12-02, 20:40:53.761 [Warning] [                                        

    ***************************

    lines 1052-1073/1073 (END)
    dez 02 20:40:53 edson-PC audit[10901]: AVC apparmor="DENIED" operation="create" profile="/usr/lib/ipsec/charon" p
    dez 02 20:40:53 edson-PC audit[10901]: AVC apparmor="DENIED" operation="create" profile="/usr/lib/ipsec/charon" p
    dez 02 20:40:53 edson-PC audit[10901]: AVC apparmor="DENIED" operation="create" profile="/usr/lib/ipsec/charon" p
    dez 02 20:40:53 edson-PC audit[10901]: AVC apparmor="DENIED" operation="create" profile="/usr/lib/ipsec/charon" p
    dez 02 20:40:53 edson-PC audit[10901]: AVC apparmor="DENIED" operation="create" profile="/usr/lib/ipsec/charon" p
    dez 02 20:40:53 edson-PC audit[10901]: AVC apparmor="DENIED" operation="create" profile="/usr/lib/ipsec/charon" p
    dez 02 20:40:53 edson-PC audit[10901]: AVC apparmor="DENIED" operation="create" profile="/usr/lib/ipsec/charon" p
    dez 02 20:40:53 edson-PC audit[10901]: AVC apparmor="DENIED" operation="create" profile="/usr/lib/ipsec/charon" p
    dez 02 20:40:53 edson-PC audit[10901]: AVC apparmor="DENIED" operation="create" profile="/usr/lib/ipsec/charon" p
    dez 02 20:40:53 edson-PC kernel: audit: type=1400 audit(1543790453.706:6330): apparmor="DENIED" operation="create
    dez 02 20:40:53 edson-PC kernel: audit: type=1400 audit(1543790453.706:6331): apparmor="DENIED" operation="create
    dez 02 20:40:53 edson-PC kernel: audit: type=1400 audit(1543790453.706:6332): apparmor="DENIED" operation="create
    dez 02 20:40:53 edson-PC kernel: audit: type=1400 audit(1543790453.706:6333): apparmor="DENIED" operation="create
    dez 02 20:40:53 edson-PC kernel: audit: type=1400 audit(1543790453.706:6334): apparmor="DENIED" operation="create
    dez 02 20:40:53 edson-PC kernel: audit: type=1400 audit(1543790453.706:6335): apparmor="DENIED" operation="create
    dez 02 20:40:53 edson-PC kernel: audit: type=1400 audit(1543790453.706:6336): apparmor="DENIED" operation="create
    dez 02 20:40:53 edson-PC starter[4475]: charon has died -- restart scheduled (5sec)
    dez 02 20:40:53 edson-PC ipsec[4475]: charon has died -- restart scheduled (5sec)
    dez 02 20:40:53 edson-PC ipsec[4475]: charon refused to be started
    dez 02 20:40:53 edson-PC starter[4475]: charon refused to be started
    dez 02 20:40:53 edson-PC com.deepin.menu[5134]: 2018-12-02, 20:40:53.760 [Warning] [                             
    dez 02 20:40:53 edson-PC com.deepin.menu[5134]: 2018-12-02, 20:40:53.761 [Warning] [                             
    ~
    Thanks in advance for the help of how to proceed to continue the installation correctly.

    Serial.com


  4. 18 часов назад, Ivan.Ponomarev сказал:

    Hello!

    Have you already checked the mentioned? 

    Thanks!

    Hello Ivan

    I am a Linux beginner and have no in-depth knowledge of these issues.

    I am just an ordinary user wanting information security.

    Could you tell me how to proceed before said "See" systemctl status kesl-supervisor.service "and" journalctl -xe "for details." and do the installation correctly, since the site does not provide a step by step how to do?

    Thank you in advance for your attention.


  5. В 01.12.2018 в 19:44, Konstantin Antonov сказал:

    Hi,

    Could you please create incident in CompanyAccount and describe your problem there.

    Thank you!

    Hi,

     do not have an account yet.

    I downloaded this version of EVALUATION for Linux to do a test and see how it would behave on some machines with Deepin 15.8. If you can still help me in this matter I am grateful.


  6. Note: I was able to install the graphic mode of the program, but it is still disabled.

    sudo /opt/kaspersky/kesl/bin/kesl-setup.pl -G
    [sudo] senha para edson: 

    Kaspersky Endpoint Security 10 SP1 for Linux version 10.1.0.5960


    Configuring GUI

    Do you want to use the GUI? [y/n]: y

    libfontconfig1:amd64: /usr/lib/x86_64-linux-gnu/libfontconfig.so.1.11.1
    libfontconfig1:amd64: /usr/lib/x86_64-linux-gnu/libfontconfig.so.1
    libfreetype6:amd64: /usr/lib/x86_64-linux-gnu/libfreetype.so.6
    stacer: /usr/share/stacer/lib/libfreetype.so.6
    libfreetype6:amd64: /usr/lib/x86_64-linux-gnu/libfreetype.so.6.15.0
    libice6:amd64: /usr/lib/x86_64-linux-gnu/libICE.so.6.3.0
    libice6:amd64: /usr/lib/x86_64-linux-gnu/libICE.so.6
    libsm6:amd64: /usr/lib/x86_64-linux-gnu/libSM.so.6
    libsm6:amd64: /usr/lib/x86_64-linux-gnu/libSM.so.6.0.1
    libx11-6:amd64: /usr/lib/x86_64-linux-gnu/libX11.so.6
    libx11-6:amd64: /usr/lib/x86_64-linux-gnu/libX11.so.6.3.0
    libx11-xcb1:amd64: /usr/lib/x86_64-linux-gnu/libX11-xcb.so.1.0.0
    stacer: /usr/share/stacer/lib/libX11-xcb.so.1
    libx11-xcb1:amd64: /usr/lib/x86_64-linux-gnu/libX11-xcb.so.1
    libxcb-icccm4:amd64: /usr/lib/x86_64-linux-gnu/libxcb-icccm.so.4.0.0
    libxcb-icccm4:amd64: /usr/lib/x86_64-linux-gnu/libxcb-icccm.so.4
    stacer: /usr/share/stacer/lib/libxcb-icccm.so.4
    libxcb-image0:amd64: /usr/lib/x86_64-linux-gnu/libxcb-image.so.0
    libxcb-image0:amd64: /usr/lib/x86_64-linux-gnu/libxcb-image.so.0.0.0
    stacer: /usr/share/stacer/lib/libxcb-image.so.0
    libxcb-keysyms1:amd64: /usr/lib/x86_64-linux-gnu/libxcb-keysyms.so.1
    stacer: /usr/share/stacer/lib/libxcb-keysyms.so.1
    libxcb-keysyms1:amd64: /usr/lib/x86_64-linux-gnu/libxcb-keysyms.so.1.0.0
    libxcb-randr0:amd64: /usr/lib/x86_64-linux-gnu/libxcb-randr.so.0.1.0
    libxcb-randr0:amd64: /usr/lib/x86_64-linux-gnu/libxcb-randr.so.0
    stacer: /usr/share/stacer/lib/libxcb-randr.so.0
    libxcb-render0:amd64: /usr/lib/x86_64-linux-gnu/libxcb-render.so.0.0.0
    stacer: /usr/share/stacer/lib/libxcb-render.so.0
    libxcb-render0:amd64: /usr/lib/x86_64-linux-gnu/libxcb-render.so.0
    stacer: /usr/share/stacer/lib/libxcb-render-util.so.0
    libxcb-render-util0:amd64: /usr/lib/x86_64-linux-gnu/libxcb-render-util.so.0
    libxcb-render-util0:amd64: /usr/lib/x86_64-linux-gnu/libxcb-render-util.so.0.0.0
    libxcb-shape0:amd64: /usr/lib/x86_64-linux-gnu/libxcb-shape.so.0.0.0
    stacer: /usr/share/stacer/lib/libxcb-shape.so.0
    libxcb-shape0:amd64: /usr/lib/x86_64-linux-gnu/libxcb-shape.so.0
    libxcb-shm0:amd64: /usr/lib/x86_64-linux-gnu/libxcb-shm.so.0
    stacer: /usr/share/stacer/lib/libxcb-shm.so.0
    libxcb-shm0:amd64: /usr/lib/x86_64-linux-gnu/libxcb-shm.so.0.0.0
    libxcb1:amd64: /usr/lib/x86_64-linux-gnu/libxcb.so.1
    libxcb1:amd64: /usr/lib/x86_64-linux-gnu/libxcb.so.1.1.0
    libxcb-sync1:amd64: /usr/lib/x86_64-linux-gnu/libxcb-sync.so.1
    libxcb-sync1:amd64: /usr/lib/x86_64-linux-gnu/libxcb-sync.so.1.0.0
    stacer: /usr/share/stacer/lib/libxcb-sync.so.1
    libxcb-xfixes0:amd64: /usr/lib/x86_64-linux-gnu/libxcb-xfixes.so.0.0.0
    stacer: /usr/share/stacer/lib/libxcb-xfixes.so.0
    libxcb-xfixes0:amd64: /usr/lib/x86_64-linux-gnu/libxcb-xfixes.so.0
    libxcb-xinerama0:amd64: /usr/lib/x86_64-linux-gnu/libxcb-xinerama.so.0.0.0
    libxcb-xinerama0:amd64: /usr/lib/x86_64-linux-gnu/libxcb-xinerama.so.0
    stacer: /usr/share/stacer/lib/libxcb-xinerama.so.0
    libxcb-xkb1:amd64: /usr/lib/x86_64-linux-gnu/libxcb-xkb.so.1
    libxcb-xkb1:amd64: /usr/lib/x86_64-linux-gnu/libxcb-xkb.so.1.0.0
    libxi6:amd64: /usr/lib/x86_64-linux-gnu/libXi.so.6.1.0
    stacer: /usr/share/stacer/lib/libXi.so.6
    libxi6:amd64: /usr/lib/x86_64-linux-gnu/libXi.so.6
    libxml2:amd64: /usr/lib/x86_64-linux-gnu/libxml2.so.2
    libxml2:amd64: /usr/lib/x86_64-linux-gnu/libxml2.so.2.9.4
    Looking for the graphical login session
    Found graphical login session (user edson, pid 6944)
    Getting environment from the graphical login session
    Getting user info
    Got user info (uid 1000, gid 1000)
    Starting GUI in the graphical login session
    edson@edson-PC:~$ 

     

    Captura de Tela_20181201125840.png


  7. Hello Equipe Kaspersky

    Installs but does not initialize

    I was able to install kesl_10.1.0-5960_amd64.deb on Deepin 15.8 for 30 days evaluation, but it does not boot.

    (Reading database ... 230444 files and directories currently installed.)
    Preparing to unpack .../kesl_10.1.0-5960_amd64.deb ...
    Unpacking kesl (10.1.0-5960) over (10.1.0-5960) ...
    Setting up kesl (10.1.0-5960) ...

    Kaspersky Endpoint Security 10 SP1 for Linux 10.1.0.5960 update has been installed.

    Processing triggers for man-db (2.8.3-2) ...

    The installation was done via Deepin Package Manager and everything was installed ok, with no errors. but when initializing with

    sudo /opt/kaspersky/kesl/bin/kesl-setup.pl the following "error" message appears.

    edson@edson-PC:~$ sudo /opt/kaspersky/kesl/bin/kesl-setup.pl

    Kaspersky Endpoint Security 10 SP1 for Linux version 10.1.0.5960


    Setting up the Anti-Virus Service default locale

    You must specify a locale that the Anti-Virus Service will use when
    applying the protection settings.
    It is important to specify the locale you are using when working with the
    file system names (in most cases this should be the system default locale)
    [pt_BR.UTF-8]:     

    Anti-Virus Service default locale is changed to 'pt_BR.UTF-8'.
    Service will be restarted if it is already running.

    Configuring KSN

    Do you want to participate in KSN (you can read the KSN Statement here:
    '/opt/kaspersky/kesl/doc/ksn_license.en')? [y/n]: n


    Configuring file interceptors

    Checking if fanotify is available...
    Using fanotify interceptor
    Starting Kaspersky Endpoint Security 10 SP1 for Linux. This can take some
    time. Please wait.

    Error: Job for kesl-supervisor.service failed because the control process
    exited with error code.
    See "systemctl status kesl-supervisor.service" and "journalctl -xe" for
    details.
    kesl not started

    ********************************************

    edson@edson-PC:/opt/kaspersky/kesl/libexec$ sudo ./prepare_module.sh
    checking for gcc... gcc
    checking whether the C compiler works... yes
    checking for C compiler default output file name... a.out
    checking for suffix of executables... 
    checking whether we are cross compiling... no
    checking for suffix of object files... o
    checking whether we are using the GNU C compiler... yes
    checking whether gcc accepts -g... yes
    checking for gcc option to accept ISO C89... none needed
    checking build system type... x86_64-unknown-linux-gnu
    checking host system type... x86_64-unknown-linux-gnu
    checking target system type... x86_64-unknown-linux-gnu
    Debian 8.0
    checking for linux kernel sources... /lib/modules/4.15.0-29deepin-generic/build
    checking for linux kernel version file... /lib/modules/4.15.0-29deepin-generic/build/include/generated/utsrelease.h
    checking for linux kernel version... 4.15
    checking for arch_ptrace... found, address 0xffffffff8143cfe0
    checking for access_process_vm... found, address 0xffffffff81611a30
    checking for __ptrace_link... found, address 0xffffffff81498400
    checking for __ptrace_unlink... found, address 0xffffffff81498740
    checking for get_empty_filp... found, address 0xffffffff816761c0
    checking for release_open_intent... found, address 0
    checking for sys_call_table... found, address 0xffffffff822001a0
    checking for kstrdup... found, address 0xffffffff815f4000
    checking whether dentry.d_child is available... yes
    checking whether struct inode_operations have rename2... no
    checking whether struct inode_operations have dentry_open... no
    checking whether __ptrace_link uses task cred struct as a third argument... yes
    configure: creating ./config.status
    config.status: creating redirfs/Makefile
    config.status: creating Makefile
    config.status: creating kavmon.h
    config.status: creating osdef.h
    config.status: creating module.linux/Makefile
    Making link in redirfs
    make[1]: Entering directory '/var/opt/kaspersky/kesl/10.1.0.5960_1543665075/opt/kaspersky/kesl/src/kernel/redirfs'
    make -C /lib/modules/4.15.0-29deepin-generic/build SUBDIRS=/var/opt/kaspersky/kesl/10.1.0.5960_1543665075/opt/kaspersky/kesl/src/kernel/redirfs modules
    make[2]: Entering directory '/usr/src/linux-headers-4.15.0-29deepin-generic'
      CC [M]  /var/opt/kaspersky/kesl/10.1.0.5960_1543665075/opt/kaspersky/kesl/src/kernel/redirfs/rfs_path.o
      CC [M]  /var/opt/kaspersky/kesl/10.1.0.5960_1543665075/opt/kaspersky/kesl/src/kernel/redirfs/rfs_root.o
    ./scripts/ubuntu-retpoline-extract-one: linha 133: printf: 0x00000000".rela.discard.retpoline_safe":: número do hexa inválido
    ./scripts/ubuntu-retpoline-extract-one: linha 134: printf: 0xção: número do hexa inválido
    symbolmap: 00000037: invalid section
      CC [M]  /var/opt/kaspersky/kesl/10.1.0.5960_1543665075/opt/kaspersky/kesl/src/kernel/redirfs/rfs_info.o
    ./scripts/ubuntu-retpoline-extract-one: linha 133: printf: 0x00000000".rela.discard.retpoline_safe":: número do hexa inválido
    ./scripts/ubuntu-retpoline-extract-one: linha 134: printf: 0xção: número do hexa inválido
    symbolmap: 00000147: invalid section
      CC [M]  /var/opt/kaspersky/kesl/10.1.0.5960_1543665075/opt/kaspersky/kesl/src/kernel/redirfs/rfs_file.o
    ./scripts/ubuntu-retpoline-extract-one: linha 133: printf: 0x00000000".rela.discard.retpoline_safe":: número do hexa inválido
    ./scripts/ubuntu-retpoline-extract-one: linha 134: printf: 0xção: número do hexa inválido
    symbolmap: 00000040: invalid section
      CC [M]  /var/opt/kaspersky/kesl/10.1.0.5960_1543665075/opt/kaspersky/kesl/src/kernel/redirfs/rfs_dentry.o
    ./scripts/ubuntu-retpoline-extract-one: linha 133: printf: 0x00000000".rela.discard.retpoline_safe":: número do hexa inválido
    ./scripts/ubuntu-retpoline-extract-one: linha 134: printf: 0xção: número do hexa inválido
    symbolmap: 00000247: invalid section
      CC [M]  /var/opt/kaspersky/kesl/10.1.0.5960_1543665075/opt/kaspersky/kesl/src/kernel/redirfs/rfs_flt.o
    ./scripts/ubuntu-retpoline-extract-one: linha 133: printf: 0x00000000".rela.discard.retpoline_safe":: número do hexa inválido
    ./scripts/ubuntu-retpoline-extract-one: linha 134: printf: 0xção: número do hexa inválido
    symbolmap: 000003d0: invalid section
      CC [M]  /var/opt/kaspersky/kesl/10.1.0.5960_1543665075/opt/kaspersky/kesl/src/kernel/redirfs/rfs_inode.o
    /var/opt/kaspersky/kesl/10.1.0.5960_1543665075/opt/kaspersky/kesl/src/kernel/redirfs/rfs_inode.c: In function ‘rfs_getattr’:
    /var/opt/kaspersky/kesl/10.1.0.5960_1543665075/opt/kaspersky/kesl/src/kernel/redirfs/rfs_inode.c:1274:55: error: passing argument 1 of ‘rinode->op_old->getattr’ from incompatible pointer type [-Werror=incompatible-pointer-types]
                 rargs.rv.rv_int = rinode->op_old->getattr(rargs.args.i_getattr.mnt,
                                                           ^~~~~
    /var/opt/kaspersky/kesl/10.1.0.5960_1543665075/opt/kaspersky/kesl/src/kernel/redirfs/rfs_inode.c:1274:55: note: expected ‘const struct path *’ but argument is of type ‘struct vfsmount *’
    /var/opt/kaspersky/kesl/10.1.0.5960_1543665075/opt/kaspersky/kesl/src/kernel/redirfs/rfs_inode.c:1275:55: error: passing argument 2 of ‘rinode->op_old->getattr’ from incompatible pointer type [-Werror=incompatible-pointer-types]
                                                           rargs.args.i_getattr.dentry,
                                                           ^~~~~
    /var/opt/kaspersky/kesl/10.1.0.5960_1543665075/opt/kaspersky/kesl/src/kernel/redirfs/rfs_inode.c:1275:55: note: expected ‘struct kstat *’ but argument is of type ‘struct dentry *’
    /var/opt/kaspersky/kesl/10.1.0.5960_1543665075/opt/kaspersky/kesl/src/kernel/redirfs/rfs_inode.c:1276:55: warning: passing argument 3 of ‘rinode->op_old->getattr’ makes integer from pointer without a cast [-Wint-conversion]
                                                           rargs.args.i_getattr.stat);
                                                           ^~~~~
    /var/opt/kaspersky/kesl/10.1.0.5960_1543665075/opt/kaspersky/kesl/src/kernel/redirfs/rfs_inode.c:1276:55: note: expected ‘u32 {aka unsigned int}’ but argument is of type ‘struct kstat *’
    /var/opt/kaspersky/kesl/10.1.0.5960_1543665075/opt/kaspersky/kesl/src/kernel/redirfs/rfs_inode.c:1274:31: error: too few arguments to function ‘rinode->op_old->getattr’
                 rargs.rv.rv_int = rinode->op_old->getattr(rargs.args.i_getattr.mnt,
                                   ^~~~~~
    In file included from /var/opt/kaspersky/kesl/10.1.0.5960_1543665075/opt/kaspersky/kesl/src/kernel/redirfs/rfs_inode.c:24:0:
    /var/opt/kaspersky/kesl/10.1.0.5960_1543665075/opt/kaspersky/kesl/src/kernel/redirfs/rfs_inode.c: In function ‘rfs_inode_set_ops_reg’:
    /var/opt/kaspersky/kesl/10.1.0.5960_1543665075/opt/kaspersky/kesl/src/kernel/redirfs/rfs.h:36:45: error: assignment from incompatible pointer type [-Werror=incompatible-pointer-types]
     #define RFS_ADD_OP(ops_new, op) (ops_new.op = rfs_##op)
                                                 ^
    /var/opt/kaspersky/kesl/10.1.0.5960_1543665075/opt/kaspersky/kesl/src/kernel/redirfs/rfs.h:41:16: note: in expansion of macro ‘RFS_ADD_OP’
         (arr[id] ? RFS_ADD_OP(ops_new, op) : RFS_REM_OP(ops_new, ops_old, op))
                    ^~~~~~~~~~
    /var/opt/kaspersky/kesl/10.1.0.5960_1543665075/opt/kaspersky/kesl/src/kernel/redirfs/rfs.h:59:12: note: in expansion of macro ‘RFS_SET_OP’
              ? RFS_SET_OP(ri->rinfo->rops->arr, id, ri->op_new, ri->op_old, op)         \
                ^~~~~~~~~~
    /var/opt/kaspersky/kesl/10.1.0.5960_1543665075/opt/kaspersky/kesl/src/kernel/redirfs/rfs_inode.c:1394:5: note: in expansion of macro ‘RFS_SET_IOP’
         RFS_SET_IOP(rinode, REDIRFS_REG_IOP_GETATTR, getattr);
         ^~~~~~~~~~~
    /var/opt/kaspersky/kesl/10.1.0.5960_1543665075/opt/kaspersky/kesl/src/kernel/redirfs/rfs_inode.c: In function ‘rfs_inode_set_ops_dir’:
    /var/opt/kaspersky/kesl/10.1.0.5960_1543665075/opt/kaspersky/kesl/src/kernel/redirfs/rfs.h:36:45: error: assignment from incompatible pointer type [-Werror=incompatible-pointer-types]
     #define RFS_ADD_OP(ops_new, op) (ops_new.op = rfs_##op)
                                                 ^
    /var/opt/kaspersky/kesl/10.1.0.5960_1543665075/opt/kaspersky/kesl/src/kernel/redirfs/rfs.h:41:16: note: in expansion of macro ‘RFS_ADD_OP’
         (arr[id] ? RFS_ADD_OP(ops_new, op) : RFS_REM_OP(ops_new, ops_old, op))
                    ^~~~~~~~~~
    /var/opt/kaspersky/kesl/10.1.0.5960_1543665075/opt/kaspersky/kesl/src/kernel/redirfs/rfs.h:59:12: note: in expansion of macro ‘RFS_SET_OP’
              ? RFS_SET_OP(ri->rinfo->rops->arr, id, ri->op_new, ri->op_old, op)         \
                ^~~~~~~~~~
    /var/opt/kaspersky/kesl/10.1.0.5960_1543665075/opt/kaspersky/kesl/src/kernel/redirfs/rfs_inode.c:1403:5: note: in expansion of macro ‘RFS_SET_IOP’
         RFS_SET_IOP(rinode, REDIRFS_DIR_IOP_GETATTR, getattr);
         ^~~~~~~~~~~
    /var/opt/kaspersky/kesl/10.1.0.5960_1543665075/opt/kaspersky/kesl/src/kernel/redirfs/rfs_inode.c: In function ‘rfs_inode_set_ops_lnk’:
    /var/opt/kaspersky/kesl/10.1.0.5960_1543665075/opt/kaspersky/kesl/src/kernel/redirfs/rfs.h:36:45: error: assignment from incompatible pointer type [-Werror=incompatible-pointer-types]
     #define RFS_ADD_OP(ops_new, op) (ops_new.op = rfs_##op)
                                                 ^
    /var/opt/kaspersky/kesl/10.1.0.5960_1543665075/opt/kaspersky/kesl/src/kernel/redirfs/rfs.h:41:16: note: in expansion of macro ‘RFS_ADD_OP’
         (arr[id] ? RFS_ADD_OP(ops_new, op) : RFS_REM_OP(ops_new, ops_old, op))
                    ^~~~~~~~~~
    /var/opt/kaspersky/kesl/10.1.0.5960_1543665075/opt/kaspersky/kesl/src/kernel/redirfs/rfs.h:59:12: note: in expansion of macro ‘RFS_SET_OP’
              ? RFS_SET_OP(ri->rinfo->rops->arr, id, ri->op_new, ri->op_old, op)         \
                ^~~~~~~~~~
    /var/opt/kaspersky/kesl/10.1.0.5960_1543665075/opt/kaspersky/kesl/src/kernel/redirfs/rfs_inode.c:1421:5: note: in expansion of macro ‘RFS_SET_IOP’
         RFS_SET_IOP(rinode, REDIRFS_LNK_IOP_GETATTR, getattr);
         ^~~~~~~~~~~
    /var/opt/kaspersky/kesl/10.1.0.5960_1543665075/opt/kaspersky/kesl/src/kernel/redirfs/rfs_inode.c: In function ‘rfs_inode_set_ops_chr’:
    /var/opt/kaspersky/kesl/10.1.0.5960_1543665075/opt/kaspersky/kesl/src/kernel/redirfs/rfs.h:36:45: error: assignment from incompatible pointer type [-Werror=incompatible-pointer-types]
     #define RFS_ADD_OP(ops_new, op) (ops_new.op = rfs_##op)
                                                 ^
    /var/opt/kaspersky/kesl/10.1.0.5960_1543665075/opt/kaspersky/kesl/src/kernel/redirfs/rfs.h:41:16: note: in expansion of macro ‘RFS_ADD_OP’
         (arr[id] ? RFS_ADD_OP(ops_new, op) : RFS_REM_OP(ops_new, ops_old, op))
                    ^~~~~~~~~~
    /var/opt/kaspersky/kesl/10.1.0.5960_1543665075/opt/kaspersky/kesl/src/kernel/redirfs/rfs.h:59:12: note: in expansion of macro ‘RFS_SET_OP’
              ? RFS_SET_OP(ri->rinfo->rops->arr, id, ri->op_new, ri->op_old, op)         \
                ^~~~~~~~~~
    /var/opt/kaspersky/kesl/10.1.0.5960_1543665075/opt/kaspersky/kesl/src/kernel/redirfs/rfs_inode.c:1428:5: note: in expansion of macro ‘RFS_SET_IOP’
         RFS_SET_IOP(rinode, REDIRFS_CHR_IOP_GETATTR, getattr);
         ^~~~~~~~~~~
    /var/opt/kaspersky/kesl/10.1.0.5960_1543665075/opt/kaspersky/kesl/src/kernel/redirfs/rfs_inode.c: In function ‘rfs_inode_set_ops_blk’:
    /var/opt/kaspersky/kesl/10.1.0.5960_1543665075/opt/kaspersky/kesl/src/kernel/redirfs/rfs.h:36:45: error: assignment from incompatible pointer type [-Werror=incompatible-pointer-types]
     #define RFS_ADD_OP(ops_new, op) (ops_new.op = rfs_##op)
                                                 ^
    /var/opt/kaspersky/kesl/10.1.0.5960_1543665075/opt/kaspersky/kesl/src/kernel/redirfs/rfs.h:41:16: note: in expansion of macro ‘RFS_ADD_OP’
         (arr[id] ? RFS_ADD_OP(ops_new, op) : RFS_REM_OP(ops_new, ops_old, op))
                    ^~~~~~~~~~
    /var/opt/kaspersky/kesl/10.1.0.5960_1543665075/opt/kaspersky/kesl/src/kernel/redirfs/rfs.h:59:12: note: in expansion of macro ‘RFS_SET_OP’
              ? RFS_SET_OP(ri->rinfo->rops->arr, id, ri->op_new, ri->op_old, op)         \
                ^~~~~~~~~~
    /var/opt/kaspersky/kesl/10.1.0.5960_1543665075/opt/kaspersky/kesl/src/kernel/redirfs/rfs_inode.c:1435:5: note: in expansion of macro ‘RFS_SET_IOP’
         RFS_SET_IOP(rinode, REDIRFS_BLK_IOP_GETATTR, getattr);
         ^~~~~~~~~~~
    /var/opt/kaspersky/kesl/10.1.0.5960_1543665075/opt/kaspersky/kesl/src/kernel/redirfs/rfs_inode.c: In function ‘rfs_inode_set_ops_fifo’:
    /var/opt/kaspersky/kesl/10.1.0.5960_1543665075/opt/kaspersky/kesl/src/kernel/redirfs/rfs.h:36:45: error: assignment from incompatible pointer type [-Werror=incompatible-pointer-types]
     #define RFS_ADD_OP(ops_new, op) (ops_new.op = rfs_##op)
                                                 ^
    /var/opt/kaspersky/kesl/10.1.0.5960_1543665075/opt/kaspersky/kesl/src/kernel/redirfs/rfs.h:41:16: note: in expansion of macro ‘RFS_ADD_OP’
         (arr[id] ? RFS_ADD_OP(ops_new, op) : RFS_REM_OP(ops_new, ops_old, op))
                    ^~~~~~~~~~
    /var/opt/kaspersky/kesl/10.1.0.5960_1543665075/opt/kaspersky/kesl/src/kernel/redirfs/rfs.h:59:12: note: in expansion of macro ‘RFS_SET_OP’
              ? RFS_SET_OP(ri->rinfo->rops->arr, id, ri->op_new, ri->op_old, op)         \
                ^~~~~~~~~~
    /var/opt/kaspersky/kesl/10.1.0.5960_1543665075/opt/kaspersky/kesl/src/kernel/redirfs/rfs_inode.c:1442:5: note: in expansion of macro ‘RFS_SET_IOP’
         RFS_SET_IOP(rinode, REDIRFS_FIFO_IOP_GETATTR, getattr);
         ^~~~~~~~~~~
    /var/opt/kaspersky/kesl/10.1.0.5960_1543665075/opt/kaspersky/kesl/src/kernel/redirfs/rfs_inode.c: In function ‘rfs_inode_set_ops_sock’:
    /var/opt/kaspersky/kesl/10.1.0.5960_1543665075/opt/kaspersky/kesl/src/kernel/redirfs/rfs.h:36:45: error: assignment from incompatible pointer type [-Werror=incompatible-pointer-types]
     #define RFS_ADD_OP(ops_new, op) (ops_new.op = rfs_##op)
                                                 ^
    /var/opt/kaspersky/kesl/10.1.0.5960_1543665075/opt/kaspersky/kesl/src/kernel/redirfs/rfs.h:41:16: note: in expansion of macro ‘RFS_ADD_OP’
         (arr[id] ? RFS_ADD_OP(ops_new, op) : RFS_REM_OP(ops_new, ops_old, op))
                    ^~~~~~~~~~
    /var/opt/kaspersky/kesl/10.1.0.5960_1543665075/opt/kaspersky/kesl/src/kernel/redirfs/rfs.h:59:12: note: in expansion of macro ‘RFS_SET_OP’
              ? RFS_SET_OP(ri->rinfo->rops->arr, id, ri->op_new, ri->op_old, op)         \
                ^~~~~~~~~~
    /var/opt/kaspersky/kesl/10.1.0.5960_1543665075/opt/kaspersky/kesl/src/kernel/redirfs/rfs_inode.c:1449:5: note: in expansion of macro ‘RFS_SET_IOP’
         RFS_SET_IOP(rinode, REDIRFS_SOCK_IOP_GETATTR, getattr);
         ^~~~~~~~~~~
    cc1: some warnings being treated as errors
    make[3]: *** [scripts/Makefile.build:334: /var/opt/kaspersky/kesl/10.1.0.5960_1543665075/opt/kaspersky/kesl/src/kernel/redirfs/rfs_inode.o] Error 1
    make[2]: *** [Makefile:1552: _module_/var/opt/kaspersky/kesl/10.1.0.5960_1543665075/opt/kaspersky/kesl/src/kernel/redirfs] Error 2
    make[2]: Leaving directory '/usr/src/linux-headers-4.15.0-29deepin-generic'
    make[1]: *** [Makefile:16: redirfs_build] Error 2
    make[1]: Leaving directory '/var/opt/kaspersky/kesl/10.1.0.5960_1543665075/opt/kaspersky/kesl/src/kernel/redirfs'
    make: *** [Makefile:5: all] Error 1
    ****************************************

    Note: I only installed the package: kesl_10.1.0-5960_amd64.deb
    How to correct this situation and make it functional?

    I thank you for your attention.


  8. Não tem nada de errado com o relatório.

    Desinstale e reinstale o Kaspersky.

    Se não resolver abra um chamado no suporte.

     

     

    Já realizei este procedimento Donkid.

    Vou fazer mais alguns testes e ver o que consigo.

    Caso eu tenha alguma resposta eu deixo aqui registrado.

     

    Uma coisa que me deixa intrigado são as páginas do Facebook, onde navegando com o FF 64 ou 32 aparecem inúmeros travamentos por causa de script conforme imagem abaixo:

     

    post-176967-1456170247_thumb.jpg

     

    Obrigado!

     

    Serial.com

     


  9. Leia este tópico e crie um relatório GSI.

     

    Olá Donkid, blz?

     

    Informo que já realizei vários testes a respeito desse problema e, mesmo assim, não consigo chegar em um denominador comum.

    Talvez a conexão via rádio que possuo esteja com algum problema.

     

    Os programas que estão sendo utilizados já foram desativados separadamente e até mesmo desinstalados e, mesmo assim, os travamentos ocorrem em todos os navegadores.

    Informo que removi a versão do KIS 2016 e instalei a versão Total Security MR1 16.0.1.445 em Pt PT atualizada.

     

    Segue o link da analise solicitada.

    http://www.getsysteminfo.com/read.php?file...619ecca40883c8f

     

    Desde já agradeço pela atenção e aguardo seu retorno.

     

    Serial.com


  10. Olá Pessoal

     

    Há vários dias estou com problemas.

     

    A navegação por diversos sites trava constantemente e, chega até a travar o navegador, tendo que fecha-lo e abri-lo novamente. Após vários testes, verifiquei que ao desativar o KIS 2016 versão 16.0.0.614(d) o problema acaba por completo. Isto ocorre em todos os navegadores, Google Chrome, FF, IE e Opera atualizados.

     

    Alguém mais está tendo este problema com o KIS 2016?

    Estou com Windows 10, 8Giga de memória e HD de 1 tera.

     

    Desde já agradeço pela atenção!

     

    Serial.com

     

     


  11. Bem-vindo ao fórum.

     

    Tente manualmente importar o certificado raiz no seu Kaspersky FF 64 de Opções -> Avançado -> Certificados -> Ver Certificados -> Autoridades -> Importar, o certificado é geralmente em:

     

    C: \ ProgramData \ Kaspersky Lab \ AVP16.0.0 \ Data \ Cert (fake) Kaspersky Anti-Virus Personal Root Certificate.cer

     

     

    Olá harlan4096

     

    Foi tiro e queda. Perfeito!

    Tudo funcionando normalmente.

     

    Se possível, me tire mais uma duvida.

    Por que o KIS 2016 ou FF não fez isso automaticamente?

     

    Muito obrigado!

     

    Serial.com


  12. Olá Pessoal!

     

    Como eu faço para saber, se os plugins de segurança do kasperky internet Security 2015 instalaram no navegador Opera 30.0, uma vez que estas extensões não aparecem no gerenciador de extensões do navegador.

     

     

    Segue imagem. Obs. Estas imagens são do navegador Firefox que funciona normalmente.

     

    post-176967-1436612494_thumb.jpg

     

     

    Desde já agradeço pela atenção

     

     

    Seria.com


  13. Bom dia Equipe kaspersky!

     

    A mais ou menos 30 dias, venho tendo problemas com esta nova versão de teste do KIS 2015, sendo a versão 15.0.0.463(a).

     

    Aviso que possuo outros produtos da kaspersky em minha empresa.

     

    Sendo assim, segue relação dos problemas encontrados.

     

    1º O KIS 2015 só abre no canto superior esquerdo da tela e não mais no centro da tela como era anteriormente.

    Esta reclamação ou inconveniente pode ser visto neste link: http://forum.kaspersky.com/index.php?showtopic=300664 o qual não obtive nenhum retorno.

     

    2º Toda atualização do KIS os programas travam, onde é preciso esperar acabar de realizar a atualização para que possamos continuar a usar o micro. No primeiro mês em que instalei este programa versão teste isso não ocorria e a maquina não sentia a diferença.

    Realizei alguns procedimentos para ver se o micro está com vírus e já descartei esta possibilidade. Os travamentos ocorrem apenas quando da atualização automática do kIS 2015.

     

    3º Após atualização da versão do Firefox de 31.0 para 32.0 o verificador de URLS deixou de funcionar novamente. Esse é um problema que existe a muito tempo, porém, a kaspersky ainda não foi capaz de resolver esta questão. Imaginem quantos micros de usuários devem estar sem esta proteção importante.

     

    Este problema já foi relatado por mim várias vezes, onde pode ser visto neste link:

     

    http://forum.kaspersky.com/index.php?showt...=299890&hl=

    http://forum.kaspersky.com/index.php?showt...=260925&hl=

     

    Segue o link de análise do GetSystemInfo informando que o micro não possui nenhum problema:

    http://www.getsysteminfo.com/read.php?file...a01f1ce419db823

     

    O número de seu pedido de suporte é: 316312830

     

    Desde já agradeço pela atenção e aguardo com brevidade por uma resposta.

     

    Edson Santos

     


  14. Olá Pessoal,

     

    O KIS 15.0.0.463a está abrindo somente no canto superior ESQUERDO da Tela e não mais no centro da tela.

    A tela após aberta não se consegue mover para nenhum outro lado.

    Gostaria de saber se isto vai ser padrão ou está sendo feito a devida correção.

     

    Veja imagem:

     

    post-176967-1404834016_thumb.jpg

     

    Desde já agradeço pela atenção!

     

    Serial.com

     

    Olá Pessoal!

     

    O KIS 2015 voltou a ter o mesmo problema acima mencionado.

    Todas as telas só abrem no canto superior esquerdo e não é possível mover a tela para o centro.

     

    Aguardo retorno!

     

    Serial.com

     

     


  15. Olá Pessoal,

     

    O KIS 15.0.0.463a está abrindo somente no canto superior ESQUERDO da Tela e não mais no centro da tela.

    A tela após aberta não se consegue mover para nenhum outro lado.

    Gostaria de saber se isto vai ser padrão ou está sendo feito a devida correção.

     

    Veja imagem:

     

    post-176967-1404834016_thumb.jpg

     

    Desde já agradeço pela atenção!

     

    Serial.com

     

    Só para constar!

     

    Após atualização automática o problema foi resolvido!

     

    Grato!

     

    Serial.com


  16. Tentando encontrar uma solução para este problema notei que na pasta,

     

    C:\Program Files (x86)\Kaspersky Lab\Kaspersky Internet Security Technical Preview 15.0.0\FFExt\url_advisor@kaspersky.com\chrome\components

     

    o arquivo se instalou por 15 vezes contendo os mesmos 2 arquivo sendo: url_advisor.dll e url_advisor.xpt conforme pode ser mostrado na imagem abaixo:

     

    post-176967-1404518874_thumb.jpg

     

    Será que este não é o motivo de estar dando erro?

    Também informo que não foi possível instalar o PATCH A, pois o Update do KIS 2015 dá erro informando que o arquivo está corrompido.

     

    Desde já agradeço pela atenção e aguardo por algum tipo de retorno.

    Apesar de estar utilizando esta versão de teste sou cliente de outros produtos ativos por enquanto.

     

    Serial.com

     

    Agradeço a todos os envolvidos da equipe de desenvolvimento da Kaspersky por ter resolvido o problema da URL Advisor do KIS 15.0.0.463 com o Firefox 30.0

     

    Conforme imagem abaixo, este problema foi resolvida com uma atualização automática, sendo uma nova versão URL_Advisor 4.0.9.180.

     

    post-176967-1404748219_thumb.png

     

    Desde já agradeço pela atenção!

     

    Serial.com


  17. Olá pessoal!

     

    Alguém saberia informar se a kaspersky já encontrou uma solução para este problema?

     

    Desde já agradeço pela atenção!

     

    Serial.com

     

    Tentando encontrar uma solução para este problema notei que na pasta,

     

    C:\Program Files (x86)\Kaspersky Lab\Kaspersky Internet Security Technical Preview 15.0.0\FFExt\url_advisor@kaspersky.com\chrome\components

     

    o arquivo se instalou por 15 vezes contendo os mesmos 2 arquivo sendo: url_advisor.dll e url_advisor.xpt conforme pode ser mostrado na imagem abaixo:

     

    post-176967-1404518874_thumb.jpg

     

    Será que este não é o motivo de estar dando erro?

    Também informo que não foi possível instalar o PATCH A, pois o Update do KIS 2015 dá erro informando que o arquivo está corrompido.

     

    Desde já agradeço pela atenção e aguardo por algum tipo de retorno.

    Apesar de estar utilizando esta versão de teste sou cliente de outros produtos ativos por enquanto.

     

    Serial.com


  18. Este problema da URL advisior da kaspersky é um problema antigo e a toda nova versão, seja teste ou não, acontece sempre a mesma situação.

    Quando conseguem que a URL advisior seja compatível com FF, vem a nova versão do Firefox e não funciona mais.

     

    Vemos que em alguns outros países o problema também é o mesmo, pois existe relatos aqui mesmo no fórum que esta versão patch A também foi instalada

    e não foi solucionado o problema.

     

    Sendo assim, aguardamos com brevidade que a Kaspersky encontre uma solução definitiva para este problema.

     

    att,

     

    Serial.com

     

    Olá pessoal!

     

    Alguém saberia informar se a kaspersky já encontrou uma solução para este problema?

     

    Desde já agradeço pela atenção!

     

    Serial.com

×
×
  • Create New...

Important Information

We use cookies to make your experience of our websites better. By using and further navigating this website you accept this. Detailed information about the use of cookies on this website is available by clicking on more information.